{"text_format":"3","workbook":"xlsx","n_sheets":2,"sheets":["Cálculo Viatico Extranjero","Mantenedor"],"not_rendered":{"images":1,"macros":1,"defined_names":4,"comments":1},"read":"whole","date_system":"1900"}

{"sheet":"Cálculo Viatico Extranjero","index":0,"n_rows":38,"n_cols":14,"rows_kept":38,"merged":[[1,4,1,9],[5,2,5,9],[7,2,7,4],[7,10,7,12],[8,2,8,4],[9,2,9,4],[9,6,9,7],[9,10,9,12],[10,10,15,14],[28,7,28,9],[30,2,31,4],[30,7,30,9]]}
[]
[{"$nulls":4},"CONTRALORIA GENERAL DE LA REPÚBLICA"]
[]
[]
[]
[null,null,"CALCULADORA VIÁTICO INTERNACIONAL "]
[]
[null,"SERVICIO PÚBLICO:",{"$nulls":4},"AÑO",2016,null,null,"ESCALA REMUNERACION",null,null,"EUS"]
[null,"MUNICIPALIDAD:"]
[null,"FUNCIONARIO:",{"$nulls":4},"PERÍODO",{"$nulls":3},"OBSERVACIONES"]
[{"$nulls":6},"DESDE"]
[{"$nulls":6},"HASTA"]
[null,"GRADO:",{"$nulls":5},{"$f":"H12-H11","v":0}]
[null,"VIÁTICO BASE US$    ",{"$f":"IF(ISERROR(VLOOKUP(CONCATENATE($N$8,$C$13),Mantenedor!$J$2:$M$107,4,0)),\"\",VLOOKUP(CONCATENATE($N$8,$C$13),Mantenedor!$J$2:$M$107,4,0))","v":""}]
[]
[]
[null,"INGRESAR PAÍS:","COSTO (%)","INCREMENTO","N° DÍAS (100%):","VALOR DIARIO","VIÁTICO ","N° DÍAS (60%):","VALOR DIARIO","VIÁTICO","N° DÍAS (40%):","VALOR DIARIO","VIÁTICO"]
[1,null,{"$f":"IF(ISERROR(VLOOKUP(CONCATENATE($H$8,$B18),Mantenedor!$D:$H,4,0)),\"\",VLOOKUP(CONCATENATE($H$8,$B18),Mantenedor!$D:$H,4,0))","v":""},{"$f":"IF(OR($C$14=\"\",C18=\"\"),\"\",$C$14*C18/100)","v":""},null,{"$f":"IF(OR(D18=\"\",$C$14=\"\"),\"\",D18+$C$14)","v":""},{"$f":"IFERROR(ROUND(F18*E18,2),\"\")","v":""},null,{"$f":"IFERROR(+$F18*60/100,\"\")","v":""},{"$f":"IFERROR(ROUND(I18*H18,2),\"\")","v":""},null,{"$f":"IFERROR(+$F18*40/100,\"\")","v":""},{"$f":"IFERROR(ROUND(L18*K18,2),\"\")","v":""},{"$f":"SUM(E18,H18,K18)","v":0}]
[2,null,{"$f":"IF(ISERROR(VLOOKUP(CONCATENATE($H$8,$B19),Mantenedor!$D:$H,4,0)),\"\",VLOOKUP(CONCATENATE($H$8,$B19),Mantenedor!$D:$H,4,0))","v":""},{"$f":"IF(OR($C$14=\"\",C19=\"\"),\"\",$C$14*C19/100)","v":""},null,"","",null,"","",null,"","",0]
[3,null,{"$f":"IF(ISERROR(VLOOKUP(CONCATENATE($H$8,$B20),Mantenedor!$D:$H,4,0)),\"\",VLOOKUP(CONCATENATE($H$8,$B20),Mantenedor!$D:$H,4,0))","v":""},"",null,"","",null,"","",null,"","",0]
[4,null,{"$f":"IF(ISERROR(VLOOKUP(CONCATENATE($H$8,$B21),Mantenedor!$D:$H,4,0)),\"\",VLOOKUP(CONCATENATE($H$8,$B21),Mantenedor!$D:$H,4,0))","v":""},"",null,"","",null,"","",null,"","",0]
[5,null,{"$f":"IF(ISERROR(VLOOKUP(CONCATENATE($H$8,$B22),Mantenedor!$D:$H,4,0)),\"\",VLOOKUP(CONCATENATE($H$8,$B22),Mantenedor!$D:$H,4,0))","v":""},"",null,"","",null,"","",null,"","",0]
[6,null,{"$f":"IF(ISERROR(VLOOKUP(CONCATENATE($H$8,$B23),Mantenedor!$D:$H,4,0)),\"\",VLOOKUP(CONCATENATE($H$8,$B23),Mantenedor!$D:$H,4,0))","v":""},"",null,"","",null,"","",null,"","",0]
[{"$nulls":13},{"$f":"SUM(N18:N23)","v":0}]
[{"$nulls":4},"TOTAL DÍAS 100%",null,{"$f":"SUM(E18:E23)","v":0},null,null,"VIÁTICO 100% ",{"$f":"SUM(G18:G23)","v":{"v":0,"d":"0.00"}}]
[{"$nulls":4},"TOTAL DÍAS 60%",null,{"$f":"SUM(H18:H23)","v":0},null,null,"VIÁTICO 60%",{"$f":"SUM(J18:J23)","v":{"v":0,"d":"0.00"}}]
[{"$nulls":4},"TOTAL DÍAS 40%",null,{"$f":"SUM(K18:K23)","v":0},null,null,"VIÁTICO 40%",{"$f":"SUM(M18:M23)","v":{"v":0,"d":"0.00"}}]
[]
[{"$nulls":7},"TOTAL VIÁTICO (US$)",null,null,{"$f":"SUM(K25:K27)","v":{"v":0,"d":"0.00"}}]
[]
[null,null,"VALOR DÓLAR OBSERVADO CONFORME A LA FECHA DE AUTORIZACIÓN",{"$nulls":4},"TOTAL VIÁTICO  ($)",null,null,{"$f":"SUM(K29*G32)","v":0}]
[]
[{"$nulls":10},"Última Actualización 05/02/2016"]
[]
[null,"Nota 1: Decreto Hacienda N°1, de 1991, Homologa grados de EUS a otras Escalas de la Administración del Estado (Instrucciones Ley de Presupuesto)"]
[null,"Nota 2: Decretos Hacienda N°135, de 2011, N°137, de 2012 y N°141, de 2013, Establece coeficientes de costo de vida por país (se fija anualmente)"]
[null,"Nota 3: No se considera lo indicado en el Decreto Hacienda N°1, de 1991, Artículo 1, Inciso final."]
[null,"Nota 4: En observaciones anotar antecedentes de la comisión como n°decreto o resolución, condiciones del viaje, etc."]

{"sheet":"Mantenedor","index":1,"n_rows":1003,"n_cols":14,"rows_kept":1003,"hidden":true}
[null,"PORCENTAJE",null,null,"DESTINO","FACTOR","COSTO","VIATICO 100",{"$nulls":3},"GRADOS",null,"ESCALA"]
[null,{"v":1,"d":"100%"},2012,"2012Afganistan, Kabul","Afganistan, Kabul",0.93597561,{"$f":"(F2*$B$7)","v":563.7006708786},{"$f":"(G2+100)/100","v":{"v":6.637006708786,"d":"6.63700671"}},null,"EUSA","EUS","A",100,"EUS"]
[null,{"v":0.6,"d":"60%"},null,"2012Albania, Tirana","Albania, Tirana",0.823780488,496.13003670288003,{"v":5.961300367028801,"d":"5.96130037"},null,"EUSB","EUS","B",100,"EFS"]
[null,{"v":0.4,"d":"40%"},null,"2012Alemania, Berlín","Alemania, Berlín",1.017682927,612.90971961502,{"v":7.1290971961502,"d":"7.12909720"},null,"EUSC","EUS","C",100,"MUN"]
[{"$nulls":3},"2012Alemania, Bonn","Alemania, Bonn",0.970731707,584.63287785782,{"v":6.8463287785782,"d":"6.84632878"},null,"EUS1A","EUS","1A",70,"CGR"]
["AÑO","CONSTANTE",null,"2012Alemania, Hamburgo","Alemania, Hamburgo",1.002439024,603.7289265942401,{"v":7.037289265942401,"d":"7.03728927"},null,"EUS1B","EUS","1B",70]
[2012,602.26,null,"2012Angola, Luanda","Angola, Luanda",1.098170732,661.3843050543201,{"v":7.613843050543201,"d":"7.61384305"},null,"EUS1C","EUS","1C",70]
[2013,615.22,null,"2012Antigua Y Barbuda, St. John'S","Antigua Y Barbuda, St. John'S",0.897560976,540.56507340576,{"v":6.4056507340576,"d":"6.40565073"},null,"EUS2","EUS","2",60]
[2014,625.46,null,"2012Antillas Holandesas","Antillas Holandesas",0.897560976,540.56507340576,{"v":6.4056507340576,"d":"6.40565073"},null,"EUS3","EUS","3",60]
[2015,639.49,null,"2012Arabia Saudita, Riyadh","Arabia Saudita, Riyadh",0.884146341,532.48597533066,{"v":6.3248597533066,"d":"6.32485975"},null,"EUS4","EUS","4",60]
[2016,639.04,null,"2012Argelia, Argel","Argelia, Argel",0.874390244,526.61026835144,{"v":6.266102683514401,"d":"6.26610268"},null,"EUS5","EUS","5",60]
[{"$nulls":3},"2012Argentina, Buenos Aires","Argentina, Buenos Aires",0.818292683,492.82495126358003,{"v":5.928249512635801,"d":"5.92824951"},null,"EUS6","EUS","6",50]
[{"$nulls":3},"2012Armenia, Erevan","Armenia, Erevan",0.873780488,526.24303670288,{"v":6.2624303670287995,"d":"6.26243037"},null,"EUS7","EUS","7",50]
[{"$nulls":3},"2012Australia, Canberra","Australia, Canberra",1.110365854,668.72893923004,{"v":7.687289392300401,"d":"7.68728939"},null,"EUS8","EUS","8",50]
[{"$nulls":3},"2012Austria, Viena","Austria, Viena",1.015853659,611.80802466934,{"v":7.118080246693401,"d":"7.11808025"},null,"EUS9","EUS","9",50]
[{"$nulls":3},"2012Azerbaijan, Baku","Azerbaijan, Baku",0.975,587.2035,{"v":6.8720349999999994,"d":"6.87203500"},null,"EUS10","EUS","10",50]
[{"$nulls":3},"2012Bahamas, Nassau","Bahamas, Nassau",0.988414634,595.2825974728399,{"v":6.952825974728399,"d":"6.95282597"},null,"EUS11","EUS","11",50]
[{"$nulls":3},"2012Bahrein, Manama","Bahrein, Manama",0.965853659,581.69502466934,{"v":6.8169502466934,"d":"6.81695025"},null,"EUS12","EUS","12",50]
[{"$nulls":3},"2012Bangladesh, Dacca","Bangladesh, Dacca",0.832926829,501.63851203354,{"v":6.0163851203354,"d":"6.01638512"},null,"EUS13","EUS","13",50]
[{"$nulls":3},"2012Barbados, Bridgetown","Barbados, Bridgetown",0.911585366,549.0114025271599,{"v":6.490114025271599,"d":"6.49011403"},null,"EUS14","EUS","14",50]
[{"$nulls":3},"2012Belarús, Minsk","Belarús, Minsk",0.812195122,489.15263417572,{"v":5.8915263417572,"d":"5.89152634"},null,"EUS15","EUS","15",50]
[{"$nulls":3},"2012Bélgica, Bruselas","Bélgica, Bruselas",1.014634146,611.07356076996,{"v":7.110735607699599,"d":"7.11073561"},null,"EUS16","EUS","16",40]
[{"$nulls":3},"2012Belice, Belmopan","Belice, Belmopan",0.77804878,468.5876582428,{"v":5.6858765824279995,"d":"5.68587658"},null,"EUS17","EUS","17",40]
[{"$nulls":3},"2012Benin, Porto Novo","Benin, Porto Novo",0.897560976,540.56507340576,{"v":6.4056507340576,"d":"6.40565073"},null,"EUS18","EUS","18",40]
[{"$nulls":3},"2012Bhután, Timbu","Bhután, Timbu",0.881097561,530.64981708786,{"v":6.3064981708786005,"d":"6.30649817"},null,"EUS19","EUS","19",40]
[{"$nulls":3},"2012Bolivia, La Paz","Bolivia, La Paz",0.800609756,482.17523164856,{"v":5.8217523164855995,"d":"5.82175232"},null,"EUS20","EUS","20",40]
[{"$nulls":3},"2012Bosnia-Hercegovina, Zarajevo","Bosnia-Hercegovina, Zarajevo",0.842682927,507.51421961502,{"v":6.0751421961502,"d":"6.07514220"},null,"EUS21","EUS","21",40]
[{"$nulls":3},"2012Botswana, Gaberones","Botswana, Gaberones",0.868292683,522.93795126358,{"v":6.229379512635799,"d":"6.22937951"},null,"EUS22","EUS","22",40]
[{"$nulls":3},"2012Brasil, Brasilia","Brasil, Brasilia",1.171341463,705.45210950638,{"v":8.0545210950638,"d":"8.05452110"},null,"EUS23","EUS","23",40]
[{"$nulls":3},"2012Brunei, Bandar Seri Begawan","Brunei, Bandar Seri Begawan",1.114634146,671.29956076996,{"v":7.712995607699599,"d":"7.71299561"},null,"EUS24","EUS","24",35]
[{"$nulls":3},"2012Bulgaria, Sofia","Bulgaria, Sofia",0.821341463,494.66110950638,{"v":5.946611095063799,"d":"5.94661110"},null,"EUS25","EUS","25",35]
[{"$nulls":3},"2012Burkina Fasso, Wagadugu","Burkina Fasso, Wagadugu",0.959146341,577.65547533066,{"v":6.7765547533066,"d":"6.77655475"},null,"EUS26","EUS","26",35]
[{"$nulls":3},"2012Burundi, Bujumbura","Burundi, Bujumbura",0.904878049,544.97185379074,{"v":6.4497185379074,"d":"6.44971854"},null,"EUS27","EUS","27",35]
[{"$nulls":3},"2012Cabo Verde, Praia","Cabo Verde, Praia",0.957317073,{"$f":"(F34*$B$7)","v":576.55378038498},{"v":6.765537803849799,"d":"6.76553780"},null,"EUS28","EUS","28",35]
[{"$nulls":3},"2012Camboya, Pnom Penh","Camboya, Pnom Penh",0.751219512,452.42946329712004,{"v":5.5242946329712,"d":"5.52429463"},null,"EUS29","EUS","29",35]
[{"$nulls":3},"2012Camerún, Yacundee","Camerún, Yacundee",0.981707317,591.24304873642,{"v":6.912430487364199,"d":"6.91243049"},null,"EUS30","EUS","30",35]
[{"$nulls":3},"2012Canadá, Otawa","Canadá, Otawa",1.030487805,620.6215854392999,{"v":7.206215854392999,"d":"7.20621585"},null,"EUS31","EUS","31",35]
[{"$nulls":3},"2012Canadá, Toronto","Canadá, Toronto",1.101829268,663.5876949456799,{"v":7.635876949456799,"d":"7.63587695"},null,"CGRF/G","CGR","F/G",100]
[{"$nulls":3},"2012Canadá, Montreal","Canadá, Montreal",1.014634146,611.07356076996,{"v":7.110735607699599,"d":"7.11073561"},null,"CGR1B","CGR","1B",70]
[{"$nulls":3},"2012Chad, N'Djamena","Chad, N'Djamena",0.98597561,593.8136708786,{"v":6.938136708786,"d":"6.93813671"},null,"CGR2","CGR","2",60]
[{"$nulls":3},"2012China, Republica Popular, Beijing","China, Republica Popular, Beijing",0.951219512,572.88146329712,{"v":6.728814632971201,"d":"6.72881463"},null,"CGR3","CGR","3",60]
[{"$nulls":3},"2012China, Republica Popular, Hong Kong","China, Republica Popular, Hong Kong",1.146341463,690.39560950638,{"v":7.9039560950637995,"d":"7.90395610"},null,"CGR4","CGR","4",60]
[{"$nulls":3},"2012Chipre, Nicosia","Chipre, Nicosia",0.837804878,504.57636582428,{"v":6.0457636582428,"d":"6.04576366"},null,"CGR5","CGR","5",50]
[{"$nulls":3},"2012Colombia, Bogotá","Colombia, Bogotá",0.93902439,565.5368291214,{"v":6.655368291214001,"d":"6.65536829"},null,"CGR6","CGR","6",50]
[{"$nulls":3},"2012Union Del Comores, Moroni","Union Del Comores, Moroni",0.958536585,577.2882436821001,{"v":6.772882436821001,"d":"6.77288244"},null,"CGR7","CGR","7",50]
[{"$nulls":3},"2012Congo, Brazzaville","Congo, Brazzaville",1,602.26,{"v":7.0226,"d":"7.02260000"},null,"CGR8","CGR","8",50]
[{"$nulls":3},"2012Corea Del Sur, Seúl","Corea Del Sur, Seúl",1.097560976,661.01707340576,{"v":7.610170734057601,"d":"7.61017073"},null,"CGR9","CGR","9",50]
[{"$nulls":3},"2012Corea Del Norte, Pyongyans","Corea Del Norte, Pyongyans",0.943902439,568.47468291214,{"v":6.6847468291214,"d":"6.68474683"},null,"CGR10","CGR","10",50]
[{"$nulls":3},"2012Costa De Marfil, Avitjan","Costa De Marfil, Avitjan",0.983536585,592.3447436821,{"v":6.923447436821,"d":"6.92344744"},null,"CGR11","CGR","11",50]
[{"$nulls":3},"2012Costa Rica, San José","Costa Rica, San José",0.815243902,490.98879241851995,{"v":5.9098879241852,"d":"5.90988792"},null,"CGR12","CGR","12",50]
[{"$nulls":3},"2012Croacia, Zagreb","Croacia, Zagreb",1.001829268,603.36169494568,{"v":7.033616949456801,"d":"7.03361695"},null,"CGR13","CGR","13",50]
[{"$nulls":3},"2012Cuba, La Habana","Cuba, La Habana",0.891463415,536.8927563179,{"v":6.368927563179,"d":"6.36892756"},null,"CGR14","CGR","14",50]
[{"$nulls":3},"2012Dinamarca, Copenhage","Dinamarca, Copenhage",1.095121951,659.54814620926,{"v":7.5954814620926,"d":"7.59548146"},null,"CGR15","CGR","15",40]
[{"$nulls":3},"2012Djibuti, Djibuti","Djibuti, Djibuti",0.923780488,556.35603670288,{"v":6.5635603670288,"d":"6.56356037"},null,"CGR16","CGR","16",40]
[{"$nulls":3},"2012Dominica, Roseau","Dominica, Roseau",0.897560976,540.56507340576,{"v":6.4056507340576,"d":"6.40565073"},null,"CGR17","CGR","17",40]
[{"$nulls":3},"2012Ecuador, Quito","Ecuador, Quito",0.77804878,468.5876582428,{"v":5.6858765824279995,"d":"5.68587658"},null,"CGR18","CGR","18",40]
[{"$nulls":3},"2012EE.UU. El Paso","EE.UU. El Paso",0.85304878,513.7571582428,{"v":6.1375715824279995,"d":"6.13757158"},null,"CGR19","CGR","19",40]
[{"$nulls":3},"2012EE.UU. Miami","EE.UU. Miami",0.894512195,538.7289145607,{"v":6.387289145607,"d":"6.38728915"},null,"CGR20","CGR","20",40]
[{"$nulls":3},"2012EE.UU. Nueva York","EE.UU. Nueva York",1,602.26,{"v":7.0226,"d":"7.02260000"},null,"CGR21","CGR","21",40]
[{"$nulls":3},"2012EE.UU. San Francisco","EE.UU. San Francisco",0.934146341,562.59897533066,{"v":6.6259897533066,"d":"6.62598975"},null,"CGR22","CGR","22",40]
[{"$nulls":3},"2012EE.UU. Washington, DC","EE.UU. Washington, DC",0.894512195,538.7289145607,{"v":6.387289145607,"d":"6.38728915"},null,"CGR23","CGR","23",40]
[{"$nulls":3},"2012Egipto, El Cairo","Egipto, El Cairo",0.837195122,504.20913417572,{"v":6.0420913417572,"d":"6.04209134"},null,"MUN1","MUN",1,60]
[{"$nulls":3},"2012El Salvador, San Salvador","El Salvador, San Salvador",0.787195122,474.09613417571995,{"v":5.7409613417572,"d":"5.74096134"},null,"MUN2","MUN","2",60]
[{"$nulls":3},"2012Emiratos Arabes Uni., Abu-Dhabi","Emiratos Arabes Uni., Abu-Dhabi",1.03902439,625.7628291214,{"v":7.257628291214001,"d":"7.25762829"},null,"MUN3","MUN","3",60]
[{"$nulls":3},"2012Eritrea, Asmara","Eritrea, Asmara",0.953658537,574.35039049362,{"v":6.7435039049362,"d":"6.74350390"},null,"MUN4","MUN","4",60]
[{"$nulls":3},"2012Eslovaquia, Bratislava","Eslovaquia, Bratislava",0.970731707,{"$f":"(F66*$B$7)","v":584.63287785782},{"$f":"(G66+100)/100","v":{"v":6.8463287785782,"d":"6.84632878"}},null,"MUN5","MUN","5",60]
[{"$nulls":3},"2012Eslovenia, Ljubliana","Eslovenia, Ljubliana",0.837804878,504.57636582428,{"v":6.0457636582428,"d":"6.04576366"},null,"MUN6","MUN","6",50]
[{"$nulls":3},"2012España, Madrid","España, Madrid",0.973170732,586.10180505432,{"v":6.8610180505432,"d":"6.86101805"},null,"MUN7","MUN","7",50]
[{"$nulls":3},"2012Estonia, Tallin","Estonia, Tallin",0.887804878,534.68936582428,{"v":6.3468936582428,"d":"6.34689366"},null,"MUN8","MUN","8",50]
[{"$nulls":3},"2012Etiopia, Addis Abeba","Etiopia, Addis Abeba",0.863414634,520.0000974728399,{"v":6.2000009747283995,"d":"6.20000097"},null,"MUN9","MUN","9",50]
[{"$nulls":3},"2012Federacion De Rusia, Moscú","Federacion De Rusia, Moscú",1.115853659,672.03402466934,{"v":7.7203402466934,"d":"7.72034025"},null,"MUN10","MUN","10",50]
[{"$nulls":3},"2012Fidji, Suva","Fidji, Suva",0.881707317,531.0170487364201,{"v":6.310170487364201,"d":"6.31017049"},null,"MUN11","MUN","11",50]
[{"$nulls":3},"2012Filipinas, Manila","Filipinas, Manila",0.92195122,555.2543417572,{"v":6.552543417572,"d":"6.55254342"},null,"MUN12","MUN","12",50]
[{"$nulls":3},"2012Finlandia, Helsinski","Finlandia, Helsinski",1.038414634,625.39559747284,{"v":7.2539559747284,"d":"7.25395597"},null,"MUN13","MUN","13",50]
[{"$nulls":3},"2012Francia, París","Francia, París",1.054268293,634.9436221421801,{"v":7.349436221421801,"d":"7.34943622"},null,"MUN14","MUN","14",50]
[{"$nulls":3},"2012Gabon, Libreville","Gabon, Libreville",1.000609756,602.62723164856,{"v":7.0262723164856,"d":"7.02627232"},null,"MUN15","MUN","15",50]
[{"$nulls":3},"2012Gambia, Banjul","Gambia, Banjul",0.880487805,530.2825854393,{"v":6.302825854392999,"d":"6.30282585"},null,"MUN16","MUN","16",40]
[{"$nulls":3},"2012Georgia, Tiflis","Georgia, Tiflis",0.902439024,543.50292659424,{"v":6.4350292659424,"d":"6.43502927"},null,"MUN17","MUN","17",40]
[{"$nulls":3},"2012Ghana, Accra","Ghana, Accra",0.89695122,540.1978417572,{"v":6.401978417572,"d":"6.40197842"},null,"MUN18","MUN","18",40]
[{"$nulls":3},"2012Grecia, Atenas","Grecia, Atenas",0.935365854,563.33343923004,{"v":6.6333343923004,"d":"6.63333439"},null,"MUN19","MUN","19",40]
[{"$nulls":3},"2012Grenada, Saint George","Grenada, Saint George",0.897560976,540.56507340576,{"v":6.4056507340576,"d":"6.40565073"},null,"MUN20","MUN","20",40]
[{"$nulls":3},"2012Guatemala, C. De Guatemala","Guatemala, C. De Guatemala",0.835365854,503.10743923004,{"v":6.0310743923003995,"d":"6.03107439"},null,"EFSF/G","EFS","F/G",100]
[{"$nulls":3},"2012Guinea, Conakry","Guinea, Conakry",0.882926829,531.7515120335399,{"v":6.3175151203354,"d":"6.31751512"},null,"EFS1","EFS","1",60]
[{"$nulls":3},"2012Guinea Ecuatorial, Mulabo","Guinea Ecuatorial, Mulabo",0.96402439,580.5933291214,{"v":6.805933291214,"d":"6.80593329"},null,"EFS2","EFS","2",60]
[{"$nulls":3},"2012Guinea Bissau, Bissau","Guinea Bissau, Bissau",0.971341463,585.00010950638,{"v":6.8500010950638,"d":"6.85000110"},null,"EFS3","EFS","3",60]
[{"$nulls":3},"2012Guyana, George Town","Guyana, George Town",0.85304878,513.7571582428,{"v":6.1375715824279995,"d":"6.13757158"},null,"EFS4","EFS","4",60]
[{"$nulls":3},"2012Haiti, Puerto Príncipe","Haiti, Puerto Príncipe",0.925609756,557.45773164856,{"v":6.574577316485599,"d":"6.57457732"},null,"EFS5","EFS","5",60]
[{"$nulls":3},"2012Honduras, Tegucigalpa","Honduras, Tegucigalpa",0.815243902,490.98879241851995,{"v":5.9098879241852,"d":"5.90988792"},null,"EFS6","EFS","6",50]
[{"$nulls":3},"2012Hungria, Budapest","Hungria, Budapest",0.931097561,560.76281708786,{"v":6.607628170878599,"d":"6.60762817"},null,"EFS7","EFS","7",50]
[{"$nulls":3},"2012India, Nueva Delhi","India, Nueva Delhi",0.862195122,519.26563417572,{"v":6.192656341757201,"d":"6.19265634"},null,"EFS8","EFS","8",50]
[{"$nulls":3},"2012Indonesia, Yakarta","Indonesia, Yakarta",0.915243902,551.21479241852,{"v":6.5121479241852,"d":"6.51214792"},null,"EFS9","EFS","9",50]
[{"$nulls":3},"2012Iran, Teheran","Iran, Teheran",0.887195122,534.32213417572,{"v":6.343221341757199,"d":"6.34322134"},null,"EFS10","EFS","10",50]
[{"$nulls":3},"2012Irak, Bagdag","Irak, Bagdag",0.876219512,527.7119632971201,{"v":6.277119632971201,"d":"6.27711963"},null,"EFS11","EFS","11",50]
[{"$nulls":3},"2012Irlanda, Dublin","Irlanda, Dublin",0.972560976,585.73457340576,{"v":6.8573457340576,"d":"6.85734573"},null,"EFS12","EFS","12",50]
[{"$nulls":3},"2012Islandia, Reikiavik","Islandia, Reikiavik",0.857317073,516.32778038498,{"v":6.1632778038498,"d":"6.16327780"},null,"EFS13","EFS","13",50]
[{"$nulls":3},"2012Islas Marshall, Majuro","Islas Marshall, Majuro",0.990853659,596.75152466934,{"v":6.9675152466934005,"d":"6.96751525"},null,"EFS14","EFS","14",50]
[{"$nulls":3},"2012Islas Salomon, Honiara","Islas Salomon, Honiara",0.995731707,599.68937785782,{"v":6.9968937785782,"d":"6.99689378"},null,"EFS15","EFS","15",50]
[{"$nulls":3},"2012Israel, Tel Aviv","Israel, Tel Aviv",0.956707317,{"$f":"(F98*$B$7)","v":576.18654873642},{"v":6.761865487364201,"d":"6.76186549"},null,"EFS16","EFS","16",40]
[{"$nulls":3},"2012Italia, Roma","Italia, Roma",1.023780488,616.58203670288,{"v":7.1658203670288,"d":"7.16582037"},null,"EFS17","EFS","17",40]
[{"$nulls":3},"2012Jamaica, Kignston","Jamaica, Kignston",0.881097561,530.64981708786,{"v":6.3064981708786005,"d":"6.30649817"},null,"EFS18","EFS","18",40]
[{"$nulls":3},"2012Japon, Tokio","Japon, Tokio",1.434146341,863.72897533066,{"v":9.6372897533066,"d":"9.63728975"},null,"EFS19","EFS","19",40]
[{"$nulls":3},"2012Jordania, Amman","Jordania, Amman",0.867073171,522.20348796646,{"v":6.2220348796646,"d":"6.22203488"},null,"EFS20","EFS","20",40]
[{"$nulls":3},"2012Kazakhstan, Alma Ata","Kazakhstan, Alma Ata",0.966463415,582.0622563178999,{"v":6.820622563179,"d":"6.82062256"},null,"EFS21","EFS","21",40]
[{"$nulls":3},"2012Kenya, Nairobi","Kenya, Nairobi",0.812804878,489.51986582428,{"v":5.8951986582428,"d":"5.89519866"},null,"EFS22","EFS","22",40]
[{"$nulls":3},"2012Kirguistan, Biskek","Kirguistan, Biskek",0.87804878,528.8136582428,{"v":6.288136582428,"d":"6.28813658"},null,"EFS23","EFS","23",40]
[{"$nulls":3},"2012Kiribati, Bairiki","Kiribati, Bairiki",1.1,662.486,{"v":7.62486,"d":"7.62486000"},null,"EFS24","EFS","24",40]
[{"$nulls":3},"2012Kuwait, Al Kuwait","Kuwait, Al Kuwait",0.887195122,534.32213417572,{"v":6.343221341757199,"d":"6.34322134"},null,"EFS25","EFS","25",40]
[{"$nulls":3},"2012Republica Popular Democratica De Laos, Vientiane","Republica Popular Democratica De Laos, Vientiane",0.852439024,513.38992659424,{"v":6.1338992659424,"d":"6.13389927"}]
[{"$nulls":3},"2012Lesotho, Maseru","Lesotho, Maseru",0.88902439,535.4238291214,{"v":6.354238291214,"d":"6.35423829"}]
[{"$nulls":3},"2012Letonia, Riga","Letonia, Riga",0.925609756,557.45773164856,{"v":6.574577316485599,"d":"6.57457732"}]
[{"$nulls":3},"2012El Libano, Beirut","El Libano, Beirut",0.914634146,550.8475607699601,{"v":6.508475607699601,"d":"6.50847561"}]
[{"$nulls":3},"2012Liberia, Monrovia","Liberia, Monrovia",0.908536585,547.1752436821,{"v":6.471752436821,"d":"6.47175244"}]
[{"$nulls":3},"2012Libia, Tripoli","Libia, Tripoli",0.821341463,494.66110950638,{"v":5.946611095063799,"d":"5.94661110"}]
[{"$nulls":3},"2012Lituania, Vilna","Lituania, Vilna",0.873170732,525.8758050543199,{"v":6.258758050543199,"d":"6.25875805"}]
[{"$nulls":3},"2012Luxemburgo","Luxemburgo",1.048780488,631.63853670288,{"v":7.3163853670288,"d":"7.31638537"}]
[{"$nulls":3},"2012Macedonia, Skopje","Macedonia, Skopje",0.825,496.86449999999996,{"v":5.968644999999999,"d":"5.96864500"}]
[{"$nulls":3},"2012Madagascar, Antananarivo","Madagascar, Antananarivo",0.865853659,521.46902466934,{"v":6.2146902466934,"d":"6.21469025"}]
[{"$nulls":3},"2012Malasia, Kuala Lumpur","Malasia, Kuala Lumpur",0.867682927,522.57071961502,{"v":6.2257071961502,"d":"6.22570720"}]
[{"$nulls":3},"2012Malawi, Lilongwe","Malawi, Lilongwe",0.927439024,558.55942659424,{"v":6.5855942659424,"d":"6.58559427"}]
[{"$nulls":3},"2012Maldivas, Male","Maldivas, Male",0.859146341,517.42947533066,{"v":6.1742947533066,"d":"6.17429475"}]
{"$rows_left_out":883}